Coda File System

rpc2 build failed under FreeBSD 4.3

From: Matthias Teege <>
Date: 07 Sep 2001 09:03:15 +0200

the make of rpc2 port, failed with the following message:

cc -I/usr/local/include -I/usr/local/include -O -pipe -o
.libs/rpc2test rpc2test.o  -L/usr/local/lib
./.libs/ ./.libs/ -llwp -Wl,--rpath
creating rpc2test
gmake[2]: Leaving directory `/usr/ports/devel/rpc2/work/rpc2-1.12/rpc2-src'
Making all in rp2gen
gmake[2]: Entering directory `/usr/ports/devel/rpc2/work/rpc2-1.12/rp2gen'
cc -I../include -I../include -c rp2main.c
cc -I../include -I../include -c rp2gen_parser.c
cc -I../include -I../include -c rp2gen_lexer.c
cc -I../include -I../include -c symtab.c
cc -I../include -I../include -c crout.c
cc -I../include -I../include -c util.c
util.c: In function `date':
util.c:286: conflicting types for `time'
/usr/include/time.h:132: previous declaration of `time'
util.c:286: warning: extern declaration of `time'doesn't match global one
gmake[2]: *** [util.o] Error 1
gmake[2]: Leaving directory `/usr/ports/devel/rpc2/work/rpc2-1.12/rp2gen'
gmake[1]: *** [all-recursive] Error 1
gmake[1]: Leaving directory `/usr/ports/devel/rpc2/work/rpc2-1.12'
gmake: *** [all-recursive-am] Error 2
*** Error code 2

Stop in /usr/ports/devel/rpc2.
*** Error code 1

Stop in /usr/ports/devel/rpc2.
*** Error code 1

Stop in /usr/ports/devel/rpc2.

What ist the problem? Can anybody reproduce this? My
system is:

FreeBSD 4.3-STABLE FreeBSD 4.3-STABLE #0: Mon
Jun  4

Many thanks

Matthias Teege -- --
make world not war
PGP-Key auf Anfrage
Received on 2001-09-07 03:22:40